BDBM225998 FXR_91
SMILES O=C(Nc1ccccc1)c1c2CN(CCc2nn1-c1ccccc1)S(=O)(=O)c1cccs1
InChI Key InChIKey=QCNPXDCBXDKKBW-UHFFFAOYSA-N
Data  1 IC50
  Tab Delimited (TSV)   2D SDfile   Computed 3D by Vconf -m prep SDfile
Find this compound or compounds like it in BindingDB:
Activity Spreadsheet -- Enzyme Inhibition Constant Data from BindingDB
Found 1 hit for monomerid = 225998
TargetBile acid receptor(Homo sapiens (Human))
D3R/Abbott
LigandPNGBDBM225998(FXR_91)
Affinity DataIC50:  2.96E+4nMpH: 7.4Assay Description:The assay buffer contained 50 mM HEPES (pH 7.4), 10 mM NaCl, 5 mM MgCl2 and 0.01% CHAPS. The reactions were incubated for 30 min in the presence of [...
Ligand InfoPC cidPC sid
In DepthDetails PubMed