BDBM226069 GTC000056A
SMILES Fc1cc(ccc1N1CC[C@H](NS(=O)(=O)\C=C\c2ccc(Cl)s2)C1=O)C(=O)NCc1ccncc1
InChI Key InChIKey=SQYWVOHXIIJDBT-BEBFYNPSSA-N
Data  1 IC50
  Tab Delimited (TSV)   2D SDfile   Computed 3D by Vconf -m prep SDfile
Find this compound or compounds like it in BindingDB:
Activity Spreadsheet -- Enzyme Inhibition Constant Data from BindingDB
Found 1 hit for monomerid = 226069
TargetCoagulation factor X(Homo sapiens (Human))
D3R/Abbott
LigandPNGBDBM226069(GTC000056A)
Affinity DataIC50:  563nM. Assay description: D3R246
Ligand InfoPC cidPC sid
In DepthDetails PubMed