BDBM226095 GTC000082A
SMILES CN(CCc1cccnc1)C(=O)c1ccc(N2CC[C@H](NS(=O)(=O)c3cc4ccc(Cl)cc4s3)C2=O)c(F)c1
InChI Key InChIKey=FNLXHTCIXFWNNP-QFIPXVFZSA-N
Data  1 IC50
  Tab Delimited (TSV)   2D SDfile   Computed 3D by Vconf -m prep SDfile
Find this compound or compounds like it in BindingDB:
Activity Spreadsheet -- Enzyme Inhibition Constant Data from BindingDB
Found 1 hit for monomerid = 226095
TargetCoagulation factor X(Homo sapiens (Human))
D3R/Abbott
LigandPNGBDBM226095(GTC000082A)
Affinity DataIC50:  91.5nM. Assay description: D3R246
Ligand InfoPC cidPC sid
In DepthDetails PubMed