BDBM226219 US9321790, 31
SMILES Cc1cc(cnc1N)C(=O)CN1[C@@H](CCn2c1nc(cc2=O)N1C[C@@H]2C[C@H]1CO2)C(F)(F)F
InChI Key InChIKey=DPOASVSBGPHHSW-DZKIICNBSA-N
Data  1 IC50
  Tab Delimited (TSV)   2D SDfile   Computed 3D by Vconf -m prep SDfile
Find this compound or compounds like it in BindingDB:
Activity Spreadsheet -- Enzyme Inhibition Constant Data from BindingDB
Found 1 hit for monomerid = 226219
LigandPNGBDBM226219(US9321790, 31)
Affinity DataIC50:  6.35E+3nMpH: 7.5Assay Description:The compounds according to the invention underwent pharmacological trials to measure the selectivity toward human lipid kinases and especially human ...
Ligand InfoPC cidPC sid
In DepthDetails US Patent