BDBM226235 US9321790, 47
SMILES FC(F)(F)[C@@H]1CCn2c(nc(cc2=O)N2C[C@@H]3C[C@H]2CO3)N1CC(=O)c1ccc2snnc2c1
InChI Key InChIKey=BOTCUWNTEBQQMA-DCGLDWPTSA-N
Data  1 IC50
  Tab Delimited (TSV)   2D SDfile   Computed 3D by Vconf -m prep SDfile
Find this compound or compounds like it in BindingDB:
Activity Spreadsheet -- Enzyme Inhibition Constant Data from BindingDB
Found 1 hit for monomerid = 226235
LigandPNGBDBM226235(US9321790, 47)
Affinity DataIC50: >1.00E+4nMpH: 7.5Assay Description:The compounds according to the invention underwent pharmacological trials to measure the selectivity toward human lipid kinases and especially human ...
Ligand InfoPC cidPC sid
In DepthDetails US Patent