BDBM226247 US9321790, 59
SMILES Cc1nc(CN2[C@@H](CCn3c2nc(cc3=O)N2C[C@@H]3C[C@H]2CO3)C(F)(F)F)no1
InChI Key InChIKey=YSSRVXFCHRPMQW-SRVKXCTJSA-N
Data  1 IC50
  Tab Delimited (TSV)   2D SDfile   Computed 3D by Vconf -m prep SDfile
Find this compound or compounds like it in BindingDB:
Activity Spreadsheet -- Enzyme Inhibition Constant Data from BindingDB
Found 1 hit for monomerid = 226247
LigandPNGBDBM226247(US9321790, 59)
Affinity DataIC50: >1.00E+4nMpH: 7.5Assay Description:The compounds according to the invention underwent pharmacological trials to measure the selectivity toward human lipid kinases and especially human ...
Ligand InfoPC cidPC sid
In DepthDetails US Patent