BDBM226251 US9321790, 63
SMILES FCCOc1ccc(cn1)C(=O)CN1[C@@H](CCn2c1nc(cc2=O)N1C[C@@H]2C[C@H]1CO2)C(F)(F)F
InChI Key InChIKey=DMJCOONYHOMYAA-ZOBUZTSGSA-N
Data  1 IC50
  Tab Delimited (TSV)   2D SDfile   Computed 3D by Vconf -m prep SDfile
Find this compound or compounds like it in BindingDB:
Activity Spreadsheet -- Enzyme Inhibition Constant Data from BindingDB
Found 1 hit for monomerid = 226251
LigandPNGBDBM226251(US9321790, 63)
Affinity DataIC50: >7.20E+3nMpH: 7.5Assay Description:The compounds according to the invention underwent pharmacological trials to measure the selectivity toward human lipid kinases and especially human ...
Ligand InfoPC cidPC sid
In DepthDetails US Patent