BDBM226272 US9321790, 84
SMILES Cc1c(nc2N(CCCc3ccccc3)[C@@H](CCn2c1=O)C(F)(F)F)N1CC2CCC(C1)O2
InChI Key InChIKey=MYMFJPIPASAFOC-MHJFOBGBSA-N
Data  1 IC50
  Tab Delimited (TSV)   2D SDfile   Computed 3D by Vconf -m prep SDfile
Find this compound or compounds like it in BindingDB:
Activity Spreadsheet -- Enzyme Inhibition Constant Data from BindingDB
Found 1 hit for monomerid = 226272
LigandPNGBDBM226272(US9321790, 84)
Affinity DataIC50:  200nMpH: 7.5Assay Description:The compounds according to the invention underwent pharmacological trials to measure the selectivity toward human lipid kinases and especially human ...
Ligand InfoPC cidPC sid
In DepthDetails US Patent