BDBM226274 US9321790, 86
SMILES FC(F)n1ccc(CN2[C@@H](CCn3c2nc(cc3=O)N2CC3CCC(C2)O3)C(F)(F)F)n1
InChI Key InChIKey=SCOPMEMJWYVCLN-RUXDESIVSA-N
Data  1 IC50
  Tab Delimited (TSV)   2D SDfile   Computed 3D by Vconf -m prep SDfile
Find this compound or compounds like it in BindingDB:
Activity Spreadsheet -- Enzyme Inhibition Constant Data from BindingDB
Found 1 hit for monomerid = 226274
LigandPNGBDBM226274(US9321790, 86)
Affinity DataIC50:  7.30E+3nMpH: 7.5Assay Description:The compounds according to the invention underwent pharmacological trials to measure the selectivity toward human lipid kinases and especially human ...
Ligand InfoPC cidPC sid
In DepthDetails US Patent