BDBM226306 US9321790, 118
SMILES FC(F)(F)C1CCn2c(nc(cc2=O)N2C[C@@H]3C[C@H]2CO3)N1CC(=O)C1CCN(CC1)C=O
InChI Key InChIKey=GLEPHKSXFLWQPJ-GIIGEWEBSA-N
Data  1 IC50
  Tab Delimited (TSV)   2D SDfile   Computed 3D by Vconf -m prep SDfile
Find this compound or compounds like it in BindingDB:
Activity Spreadsheet -- Enzyme Inhibition Constant Data from BindingDB
Found 1 hit for monomerid = 226306
LigandPNGBDBM226306(US9321790, 118)
Affinity DataIC50: >1.00E+4nMpH: 7.5Assay Description:The compounds according to the invention underwent pharmacological trials to measure the selectivity toward human lipid kinases and especially human ...
Ligand InfoPC cidPC sid
In DepthDetails US Patent