BDBM22671 Bicyclic pyrimidinone, 10b::N-[(4-fluorophenyl)methyl]-3-hydroxy-9-(morpholin-4-yl)-4-oxo-4H,6H,7H,8H,9H-pyrido[1,2-a]pyrimidine-2-carboxamide
SMILES Oc1c(nc2C(CCCn2c1=O)N1CCOCC1)C(=O)NCc1ccc(F)cc1
InChI Key InChIKey=AGXRVRVEFKZWCP-UHFFFAOYSA-N
Data  1 IC50
  Tab Delimited (TSV)   2D SDfile   Computed 3D by Vconf -m prep SDfile
Find this compound or compounds like it in BindingDB:
Activity Spreadsheet -- Enzyme Inhibition Constant Data from BindingDB
Found 1 hit for monomerid = 22671
TargetGag-Pol polyprotein(Human immunodeficiency virus type 1 group M subtyp...)
Irbm-Mrl
LigandPNGBDBM22671(Bicyclic pyrimidinone, 10b | N-[(4-fluorophenyl)me...)
Affinity DataIC50:  5nMpH: 7.8 T: 2°C. Assay description: The microtiter plate assay for stand transfer was performed with an immobilized donor substrate and a target substrate biotinylated at the 3-prime en...
In DepthDetails ArticlePubMed