BDBM22715 Dihydroxypyrimidine, 7::N-[(4-fluorophenyl)methyl]-5,6-dihydroxy-2-methylpyrimidine-4-carboxamide
SMILES Cc1nc(C(=O)NCc2ccc(F)cc2)c(O)c(=O)[nH]1
InChI Key InChIKey=QUOVSBFFBCDNHK-UHFFFAOYSA-N
Data  1 IC50
  Tab Delimited (TSV)   2D SDfile   Computed 3D by Vconf -m prep SDfile
Find this compound or compounds like it in BindingDB:
Activity Spreadsheet -- Enzyme Inhibition Constant Data from BindingDB
Found 1 hit for monomerid = 22715
TargetGag-Pol polyprotein(Human immunodeficiency virus type 1 group M subtyp...)
Irbm-Mrl
LigandPNGBDBM22715(Dihydroxypyrimidine, 7 | N-[(4-fluorophenyl)methyl...)
Affinity DataIC50:  60nMpH: 7.8 T: 2°C. Assay description: The microtiter plate assay for stand transfer was performed with an immobilized donor substrate and a target substrate biotinylated at the 3-prime en...
In DepthDetails ArticlePubMed