BDBM227547 US9334278, I-36
SMILES Cc1cc(Nc2nc3c(c[nH]c3nc2C)C(=O)NC(C)(C)C)sn1
InChI Key InChIKey=PAENRTZWYSNKHE-UHFFFAOYSA-N
Data  1 IC50
  Tab Delimited (TSV)   2D SDfile   Computed 3D by Vconf -m prep SDfile
Find this compound or compounds like it in BindingDB:
Activity Spreadsheet -- Enzyme Inhibition Constant Data from BindingDB
Found 1 hit for monomerid = 227547
TargetTyrosine-protein kinase SYK [360-635](Homo sapiens (Human))
Hoffmann-La Roche
US Patent
LigandPNGBDBM227547(US9334278, I-36)
Affinity DataIC50:  251nMT: 2°C. Assay description: Assay plates: 96-well MultiScreen 0.65 μm filter plates (Millipore Cat. No.: MADVNOB 10) Streptavidin coated beads: Streptavidin Sepharose™,...
Ligand InfoPC cidPC sid
In DepthDetails US Patent