BDBM227551 US9339486, 5
SMILES CC1(Cc2ccccc2)COc2ccc(cc12)C(=O)NC1CCCCC1
InChI Key InChIKey=KVZKCJVVRRGBKA-UHFFFAOYSA-N
Data  1 EC50
  Tab Delimited (TSV)   2D SDfile   Computed 3D by Vconf -m prep SDfile
Find this compound or compounds like it in BindingDB:
Activity Spreadsheet -- Enzyme Inhibition Constant Data from BindingDB
Found 1 hit for monomerid = 227551
TargetCannabinoid receptor 2(Homo sapiens (Human))
The Cleveland Clinic Foundation
US Patent
LigandPNGBDBM227551(US9339486, 5)
Affinity DataEC50:  409nM. Assay description: Functional activity was evaluated using GTPγ[35S] assay in CHO membrane extracts expressing recombinant hCB1 (human CB1) receptors or hCB2 (huma...
Ligand InfoPC cidPC sid
In DepthDetails US Patent