BDBM227587 3-fluoro-N-[4-(1,2,3,4-tetrahydroacridin-9-ylamino)butyl]benzamide hydrochloride (3f)
SMILES Fc1cccc(c1)C(=O)NCCCCNc1c2CCCCc2nc2ccccc12
InChI Key InChIKey=FCONFGFXQGSNLA-UHFFFAOYSA-N
Data  2 IC50
  Tab Delimited (TSV)   2D SDfile   Computed 3D by Vconf -m prep SDfile
Find this compound or compounds like it in BindingDB:
Activity Spreadsheet -- Enzyme Inhibition Constant Data from BindingDB
Found 2 hits for monomerid = 227587
TargetCarboxylic ester hydrolase(Equus caballus (Horse))
Medical University Of Lodz
LigandPNGBDBM227587(3-fluoro-N-[4-(1,2,3,4-tetrahydroacridin-9-ylamino...)
Affinity DataIC50:  1.02nMpH: 7.4 T: 2°C. Assay description: The test was run as described in the following procedure: stock solution of the test compounds was diluted in phosphate buffer pH 7.4 to give final c...
Ligand InfoPC cidPC sid
In DepthDetails ArticlePubMed
TargetAcetylcholinesterase(Electrophorus electricus (Electric eel))
Medical University Of Lodz
LigandPNGBDBM227587(3-fluoro-N-[4-(1,2,3,4-tetrahydroacridin-9-ylamino...)
Affinity DataIC50:  97.6nMpH: 7.4 T: 2°C. Assay description: The test was run as described in the following procedure: stock solution of the test compounds was diluted in phosphate buffer pH 7.4 to give final c...
Ligand InfoPC cidPC sid
In DepthDetails ArticlePubMed