BDBM227596 AEM2
SMILES O=C(NCc1cccnc1)c1ccc2NC(C3C4CCC(C4)C3c2c1)c1ccccc1
InChI Key InChIKey=HSJXOMZEPTVVQC-UHFFFAOYSA-N
Data  4 IC50
  Tab Delimited (TSV)   2D SDfile   Computed 3D by Vconf -m prep SDfile
Find this compound or compounds like it in BindingDB:
Activity Spreadsheet -- Enzyme Inhibition Constant Data from BindingDB
Found 4 hits for monomerid = 227596
TargetNAD-dependent protein deacetylase sirtuin-1(Homo sapiens (Human))
Universität Duisburg-Essen
LigandPNGBDBM227596(AEM2)
Affinity DataIC50: >1.00E+5nMpH: 8.0 T: 2°C. Assay description: Deacetylation assays using Boc(Ac)Lys-7-amino-4-methyl-coumarin (MAL; Bachem, Bubendorf, Switzerland) as a substrate were performed in a volume of 20...
In DepthDetails ArticlePubMed
TargetNAD-dependent protein deacetylase sirtuin-2(Homo sapiens (Human))
Sichuan University
Curated by ChEMBL
LigandPNGBDBM227596(AEM2)
Affinity DataIC50:  3.80E+3nM. Assay description: Inhibition of sirtuin 2 (unknown origin)
In DepthDetails ArticlePubMed
TargetNAD-dependent protein deacetylase sirtuin-2(Homo sapiens (Human))
Sichuan University
Curated by ChEMBL
LigandPNGBDBM227596(AEM2)
Affinity DataIC50:  2.50E+3nM. Assay description: Inhibition of human sirtuin 2 assessed as inhibition of substrate deacetylation using ZMAL as substrate
In DepthDetails ArticlePubMed
TargetNAD-dependent protein deacetylase sirtuin-2(Homo sapiens (Human))
Sichuan University
Curated by ChEMBL
LigandPNGBDBM227596(AEM2)
Affinity DataIC50:  3.80E+3nMpH: 8.0 T: 2°C. Assay description: Deacetylation assays using Boc(Ac)Lys-7-amino-4-methyl-coumarin (MAL; Bachem, Bubendorf, Switzerland) as a substrate were performed in a volume of 20...
In DepthDetails ArticlePubMed