BDBM227683 3-{6-(5-chloropyridin-3- yl)-8-[1-fluoro-1-(3- fluoropyridin-2-yl)ethyl]- 7-[(trans-4- methylcyclohexyl)methyl]- 7h-purin-2-yl}-1,2,4- oxadiazol-5(4h)-one (enantiomer 1)::US9540377, 23.98::US9540377, 23.99
SMILES C[C@H]1CC[C@H](Cn2c(nc3nc(nc(-c4cncc(Cl)c4)c23)-c2noc(=O)[nH]2)C(C)(F)c2ncccc2F)CC1
InChI Key
Data  2 IC50
  Tab Delimited (TSV)   2D SDfile   Computed 3D by Vconf -m prep SDfile
Find this compound or compounds like it in BindingDB:
Activity Spreadsheet -- Enzyme Inhibition Constant Data from BindingDB
Found 2 hits for monomerid = 227683
TargetE3 ubiquitin-protein ligase Mdm2 [17-125](Homo sapiens (Human))
Merck Sharp & Dohme
US Patent
LigandPNGBDBM227683(3-{6-(5-chloropyridin-3- yl)-8-[1-fluoro-1-(3- flu...)
Affinity DataIC50:  0.315nMT: 2°C. Assay description: An HDM2 FRET assay was developed to assess the compounds' inhibitory activity towards binding of p53 protein. A truncated version of HDM2 with re...
Ligand InfoPC cidPC sid
In DepthDetails US Patent
TargetE3 ubiquitin-protein ligase Mdm2 [17-125](Homo sapiens (Human))
Merck Sharp & Dohme
US Patent
LigandPNGBDBM227683(3-{6-(5-chloropyridin-3- yl)-8-[1-fluoro-1-(3- flu...)
Affinity DataIC50:  9.74nMT: 2°C. Assay description: An HDM2 FRET assay was developed to assess the compounds' inhibitory activity towards binding of p53 protein. A truncated version of HDM2 with re...
Ligand InfoPC cidPC sid
In DepthDetails US Patent