BDBM22770 Benzil-related compound, 49::cyclohexane-1,3-dione
SMILES O=C1CCCC(=O)C1
InChI Key InChIKey=HJSLFCCWAKVHIW-UHFFFAOYSA-N
Data  5 KI
  Tab Delimited (TSV)   2D SDfile   Computed 3D by Vconf -m prep SDfile
Find this compound or compounds like it in BindingDB:
Activity Spreadsheet -- Enzyme Inhibition Constant Data from BindingDB
Found 5 hits for monomerid = 22770
TargetCoagulation factor XII(Homo sapiens (Human))
University Of Mississippi
LigandPNGBDBM22770(Benzil-related compound, 49 | cyclohexane-1,3-dion...)
Affinity DataKi: >1.00E+5nM. Assay description: CE inhibition was determined using a spectrophotometric multiwell plate assay with o-NPA as a substrate. The rate of change in absorbance at 420 nm w...
In DepthDetails ArticlePubMed
TargetLiver carboxylesterase 1(Homo sapiens (Human))
University Of Mississippi
LigandPNGBDBM22770(Benzil-related compound, 49 | cyclohexane-1,3-dion...)
Affinity DataKi: >1.00E+5nM. Assay description: CE inhibition was determined using a spectrophotometric multiwell plate assay with o-NPA as a substrate. The rate of change in absorbance at 420 nm w...
In DepthDetails ArticlePubMed
TargetCholinesterase(Homo sapiens (Human))
University Of Mississippi
LigandPNGBDBM22770(Benzil-related compound, 49 | cyclohexane-1,3-dion...)
Affinity DataKi: >1.00E+5nM. Assay description: The cholinesterase assays were performed using colorimetric method reported by Ellman. Estimates of the competitive inhibition constants (Ki) were ob...
In DepthDetails ArticlePubMed
TargetAcetylcholinesterase(Homo sapiens (Human))
University Of Mississippi
LigandPNGBDBM22770(Benzil-related compound, 49 | cyclohexane-1,3-dion...)
Affinity DataKi: >1.00E+5nM. Assay description: The cholinesterase assays were performed using colorimetric method reported by Ellman. Estimates of the competitive inhibition constants (Ki) were ob...
In DepthDetails ArticlePubMed
TargetLiver carboxylesterase 1(Oryctolagus cuniculus (rabbit))
University Of Mississippi
LigandPNGBDBM22770(Benzil-related compound, 49 | cyclohexane-1,3-dion...)
Affinity DataKi: >1.00E+5nM. Assay description: CE inhibition was determined using a spectrophotometric multiwell plate assay with o-NPA as a substrate. The rate of change in absorbance at 420 nm w...
In DepthDetails ArticlePubMed