BDBM227721 3-bromo-n-(1h-indazol-5-yl)-1h-pyrazolo[3,4-d]pyrimidin-4-amine::US9556181, 15::US9556181, 6::US9556181, 9
SMILES Brc1n[nH]c2ncnc(Nc3ccc4[nH]ncc4c3)c12
InChI Key InChIKey=SKMNMXMMGNJTPP-UHFFFAOYSA-N
Data  3 IC50
  Tab Delimited (TSV)   2D SDfile   Computed 3D by Vconf -m prep SDfile
Find this compound or compounds like it in BindingDB:
Activity Spreadsheet -- Enzyme Inhibition Constant Data from BindingDB
Found 3 hits for monomerid = 227721
TargetMAP kinase-interacting serine/threonine-protein kinase 1 [1-424](Homo sapiens (Human))
Bayer Pharma Aktiengesellschaft
US Patent
LigandPNGBDBM227721(3-bromo-n-(1h-indazol-5-yl)-1h-pyrazolo[3,4-d]pyri...)
Affinity DataIC50:  14nMpH: 7.5Assay Description:TBDA recombinant fusion protein of Glutathione-S-Transferase (GST, N-terminally) and human full-length MKNK1 (amino acids 1-424 and T344D of accessio...
Ligand InfoPC cidPC sid
In DepthDetails US Patent
TargetMAP kinase-interacting serine/threonine-protein kinase 1 [1-424](Homo sapiens (Human))
Bayer Pharma Aktiengesellschaft
US Patent
LigandPNGBDBM227721(3-bromo-n-(1h-indazol-5-yl)-1h-pyrazolo[3,4-d]pyri...)
Affinity DataIC50:  26nMpH: 7.5Assay Description:TBDA recombinant fusion protein of Glutathione-S-Transferase (GST, N-terminally) and human full-length MKNK1 (amino acids 1-424 and T344D of accessio...
Ligand InfoPC cidPC sid
In DepthDetails US Patent
TargetMAP kinase-interacting serine/threonine-protein kinase 1 [1-424](Homo sapiens (Human))
Bayer Pharma Aktiengesellschaft
US Patent
LigandPNGBDBM227721(3-bromo-n-(1h-indazol-5-yl)-1h-pyrazolo[3,4-d]pyri...)
Affinity DataIC50:  8nMpH: 7.5Assay Description:TBDA recombinant fusion protein of Glutathione-S-Transferase (GST, N-terminally) and human full-length MKNK1 (amino acids 1-424 and T344D of accessio...
Ligand InfoPC cidPC sid
In DepthDetails US Patent