BDBM227732 3-bromo-n-(6-isopropoxy-1h-indazol-5-yl)-1h-pyrazolo[3,4-d]pyrimidin-4-amine::US9556181, 17::US9556181, 18::US9556181, 20::US9556181, 21
SMILES CC(C)Oc1cc2[nH]ncc2cc1Nc1ncnc2[nH]nc(Br)c12
InChI Key InChIKey=VUCOPDPBZGZUCX-UHFFFAOYSA-N
Data  4 IC50
  Tab Delimited (TSV)   2D SDfile   Computed 3D by Vconf -m prep SDfile
Find this compound or compounds like it in BindingDB:
Activity Spreadsheet -- Enzyme Inhibition Constant Data from BindingDB
Found 4 hits for monomerid = 227732
TargetMAP kinase-interacting serine/threonine-protein kinase 1 [1-424](Homo sapiens (Human))
Bayer Pharma Aktiengesellschaft
US Patent
LigandPNGBDBM227732(3-bromo-n-(6-isopropoxy-1h-indazol-5-yl)-1h-pyrazo...)
Affinity DataIC50:  1nMpH: 7.5Assay Description:TBDA recombinant fusion protein of Glutathione-S-Transferase (GST, N-terminally) and human full-length MKNK1 (amino acids 1-424 and T344D of accessio...
Ligand InfoPC cidPC sid
In DepthDetails US Patent
TargetMAP kinase-interacting serine/threonine-protein kinase 1 [1-424](Homo sapiens (Human))
Bayer Pharma Aktiengesellschaft
US Patent
LigandPNGBDBM227732(3-bromo-n-(6-isopropoxy-1h-indazol-5-yl)-1h-pyrazo...)
Affinity DataIC50:  27nMpH: 7.5Assay Description:TBDA recombinant fusion protein of Glutathione-S-Transferase (GST, N-terminally) and human full-length MKNK1 (amino acids 1-424 and T344D of accessio...
Ligand InfoPC cidPC sid
In DepthDetails US Patent
TargetMAP kinase-interacting serine/threonine-protein kinase 1 [1-424](Homo sapiens (Human))
Bayer Pharma Aktiengesellschaft
US Patent
LigandPNGBDBM227732(3-bromo-n-(6-isopropoxy-1h-indazol-5-yl)-1h-pyrazo...)
Affinity DataIC50:  63nMpH: 7.5Assay Description:TBDA recombinant fusion protein of Glutathione-S-Transferase (GST, N-terminally) and human full-length MKNK1 (amino acids 1-424 and T344D of accessio...
Ligand InfoPC cidPC sid
In DepthDetails US Patent
TargetMAP kinase-interacting serine/threonine-protein kinase 1 [1-424](Homo sapiens (Human))
Bayer Pharma Aktiengesellschaft
US Patent
LigandPNGBDBM227732(3-bromo-n-(6-isopropoxy-1h-indazol-5-yl)-1h-pyrazo...)
Affinity DataIC50:  19nMpH: 7.5Assay Description:TBDA recombinant fusion protein of Glutathione-S-Transferase (GST, N-terminally) and human full-length MKNK1 (amino acids 1-424 and T344D of accessio...
Ligand InfoPC cidPC sid
In DepthDetails US Patent