BDBM227980 US10047098, 12
SMILES C[C@H]1C[C@H]2C(=O)N(C)C(=N)N[C@]2(CO1)c1cc(Br)ccc1F
InChI Key InChIKey=LKCAELLRAREUBA-PEGZWESCSA-N
Data  2 KI
  Tab Delimited (TSV)   2D SDfile   Computed 3D by Vconf -m prep SDfile
Find this compound or compounds like it in BindingDB:
Activity Spreadsheet -- Enzyme Inhibition Constant Data from BindingDB
Found 2 hits for monomerid = 227980
TargetBeta-secretase 2(Homo sapiens (Human))
Merck Sharp & Dohme
US Patent
LigandPNGBDBM227980(US10047098, 12)
Affinity DataKi:  125nMpH: 5.0Assay Description:Inhibitor IC50s at purified human autoBACE-2 are determined in a time-resolved endpoint proteolysis assay that measures hydrolysis of the QSY7-EISEVN...
Ligand InfoPC cidPC sid
In DepthDetails US Patent
TargetBeta-secretase 1(Homo sapiens (Human))
Merck Sharp & Dohme
US Patent
LigandPNGBDBM227980(US10047098, 12)
Affinity DataKi:  562nMpH: 5.0Assay Description:Reagents: Na+-Acetate pH 5.0; 1% Brij-35; Glycerol; Dimethyl Sulfoxide (DMSO); Recombinant human soluble BACE1 catalytic domain (>95% pure); APP Swed...
Ligand InfoPC cidPC sid
In DepthDetails US Patent