BDBM228016 US10047097, 47
SMILES OC(=O)C(F)(F)F.Fc1ccc(Cl)c(c1)[C@H]1CCCN1c1ccn2ncc(NC(=O)C3CNC3)c2n1
InChI Key InChIKey=MORPZIZZIKJPAX-UNTBIKODSA-N
Data  1 IC50
  Tab Delimited (TSV)   2D SDfile   Computed 3D by Vconf -m prep SDfile
Find this compound or compounds like it in BindingDB:
Activity Spreadsheet -- Enzyme Inhibition Constant Data from BindingDB
Found 1 hit for monomerid = 228016
TargetHigh affinity nerve growth factor receptor(Homo sapiens (Human))
Array Biopharma
US Patent
LigandPNGBDBM228016(US10047097, 47)
Affinity DataIC50:  190nMpH: 7.5Assay Description:An enzyme-linked immunosorbant assay (ELISA) was used to assess TrkA kinase activity in the presence of inhibitors. Immulon 4HBX 384-well microtiter ...
Ligand InfoPC cidPC sid
In DepthDetails US Patent