BDBM228163 US10047073, 5
SMILES FC(F)(F)c1nc(no1)-c1ccc(cc1)C(=O)NC1(CN2CCC3(CC3)CC2)CC1
InChI Key InChIKey=BIULWZLYCZLVJY-UHFFFAOYSA-N
Data  1 IC50
  Tab Delimited (TSV)   2D SDfile   Computed 3D by Vconf -m prep SDfile
Find this compound or compounds like it in BindingDB:
Activity Spreadsheet -- Enzyme Inhibition Constant Data from BindingDB
Found 1 hit for monomerid = 228163
TargetHistone deacetylase 4(Homo sapiens (Human))
Chdi Foundation
US Patent
LigandPNGBDBM228163(US10047073, 5)
Affinity DataIC50:  89nM. Assay description: The Class I HDAC activity of Class IIa Histone Deacetylase (HDAC) inhibitors was quantified by measuring the cellular histone deacetylase enzymatic a...
Ligand InfoPC cidPC sid
In DepthDetails US Patent