BDBM228297 US9555022, Example 02.32
SMILES Fc1ccc(CC(=O)Nc2ccc(cc2)-c2ccc3nc(Nc4ccc(cc4C(F)(F)F)C(=O)N4CCOCC4)nn3c2)cc1
InChI Key InChIKey=GVHIREQJLZWOQA-UHFFFAOYSA-N
Data  1 IC50
  Tab Delimited (TSV)   2D SDfile   Computed 3D by Vconf -m prep SDfile
Find this compound or compounds like it in BindingDB:
Activity Spreadsheet -- Enzyme Inhibition Constant Data from BindingDB
Found 1 hit for monomerid = 228297
TargetDual specificity protein kinase TTK(Homo sapiens (Human))
Bayer Intellectual Property
US Patent
LigandPNGBDBM228297(US9555022, Example 02.32)
Affinity DataIC50: <1nMpH: 7.7Assay Description:For the assay 50 nl of a 100-fold concentrated solution of the test compound in DMSO was pipetted into a black low volume 384 well microtiter plate (...
Ligand InfoPC cidPC sid
In DepthDetails US Patent