BDBM228501 US9340521, E053
SMILES OC[C@H]1O[C@H]([C@H](O)[C@@H](O)[C@@H]1O)c1cc(Cc2cc3ccccc3s2)c(Cl)c2OCOc12
InChI Key InChIKey=ZDIQRESTFPNDBN-QSWMPLQWSA-N
Data  2 IC50
  Tab Delimited (TSV)   2D SDfile   Computed 3D by Vconf -m prep SDfile
Find this compound or compounds like it in BindingDB:
Activity Spreadsheet -- Enzyme Inhibition Constant Data from BindingDB
Found 2 hits for monomerid = 228501
TargetSodium/glucose cotransporter 1(Homo sapiens (Human))
Green Cross
US Patent
LigandPNGBDBM228501(US9340521, E053)
Affinity DataIC50:  41nMpH: 7.4 T: 2°C. Assay description: For sodium-dependent glucose transport assay, cells expressing hSGLT1 were seeded into a 96-well culture plate at a density of 5×104 cells/well...
Ligand InfoPC cidPC sid
In DepthDetails US Patent
TargetSodium/glucose cotransporter 2(Homo sapiens (Human))
Green Cross
US Patent
LigandPNGBDBM228501(US9340521, E053)
Affinity DataIC50:  1.5nMpH: 7.4 T: 2°C. Assay description: For sodium-dependent glucose transport assay, cells expressing hSGLT2 were seeded into a 96-well culture plate at a density of 5×104 cells/well...
Ligand InfoPC cidPC sid
In DepthDetails US Patent