BDBM22856 1,2-Dione-Based Compound, 13::1-azatricyclo[7.3.1.0^{5,13}]trideca-5,7,9(13)-triene-2,3,4-trione
SMILES O=C1N2CCCc3cccc(C(=O)C1=O)c23
InChI Key InChIKey=LOGJHKARPDLIGK-UHFFFAOYSA-N
Data  4 KI
  Tab Delimited (TSV)   2D SDfile   Computed 3D by Vconf -m prep SDfile
Find this compound or compounds like it in BindingDB:
Activity Spreadsheet -- Enzyme Inhibition Constant Data from BindingDB
Found 4 hits for monomerid = 22856
TargetLiver carboxylesterase 1(Homo sapiens (Human))
St. Jude Research Hospital
LigandPNGBDBM22856(1,2-Dione-Based Compound, 13 | 1-azatricyclo[7.3.1...)
Affinity DataKi:  5.38E+3nM. Assay description: CE inhibition was determined using a spectrophotometric multiwell plate assay with o-NPA as a substrate. The rate of change in absorbance at 420 nm w...
Ligand InfoPC cidPC sid
In DepthDetails ArticlePubMed
TargetCholinesterase(Homo sapiens (Human))
St. Jude Research Hospital
LigandPNGBDBM22856(1,2-Dione-Based Compound, 13 | 1-azatricyclo[7.3.1...)
Affinity DataKi: >1.00E+5nM. Assay description: The cholinesterase assays were performed using colorimetric method reported by Ellman. Estimates of the competitive inhibition constants (Ki) were ob...
Ligand InfoPC cidPC sid
In DepthDetails ArticlePubMed
TargetAcetylcholinesterase(Homo sapiens (Human))
St. Jude Research Hospital
LigandPNGBDBM22856(1,2-Dione-Based Compound, 13 | 1-azatricyclo[7.3.1...)
Affinity DataKi: >1.00E+5nM. Assay description: The cholinesterase assays were performed using colorimetric method reported by Ellman. Estimates of the competitive inhibition constants (Ki) were ob...
Ligand InfoPC cidPC sid
In DepthDetails ArticlePubMed
TargetCoagulation factor XII(Homo sapiens (Human))
St. Jude Research Hospital
LigandPNGBDBM22856(1,2-Dione-Based Compound, 13 | 1-azatricyclo[7.3.1...)
Affinity DataKi: >1.00E+5nM ΔG°: >-5.45kcal/molepH: 7.4 T: 2°C. Assay description: CE inhibition was determined using a spectrophotometric multiwell plate assay with o-NPA as a substrate. The rate of change in absorbance at 420 nm w...
Ligand InfoPC cidPC sid
In DepthDetails ArticlePubMed