BDBM228600 US9340573, 11
SMILES CN[C@@H](C)C(=O)N[C@@H](C(C)C)C(=O)N1[C@H](CNC(=O)OCc2ccccc2)Cc2cccnc12
InChI Key InChIKey=CRHVURUHLHTXLH-YYWHXJBOSA-N
Data  2 IC50
  Tab Delimited (TSV)   2D SDfile   Computed 3D by Vconf -m prep SDfile
Find this compound or compounds like it in BindingDB:
Activity Spreadsheet -- Enzyme Inhibition Constant Data from BindingDB
Found 2 hits for monomerid = 228600
TargetE3 ubiquitin-protein ligase XIAP [241-356](Artificial Sequence)
Hoffmann-La Roche
US Patent
LigandPNGBDBM228600(US9340573, 11)
Affinity DataIC50: >54.8nMpH: 7.5 T: 2°C. Assay description: The peptide AVPIAQKSEK-(ε-biotin)-OH 1:2 TFA ("Peptide A") was identified as a substrate for the TR-FRET assay by screening the 6× Hist...
Ligand InfoPC cidPC sid
In DepthDetails US Patent
TargetE3 ubiquitin-protein ligase XIAP [124-240](Artificial Sequence)
Hoffmann-La Roche
US Patent
LigandPNGBDBM228600(US9340573, 11)
Affinity DataIC50:  1.05nMpH: 7.5 T: 2°C. Assay description: The peptide AVPIAQKSEK-(ε-biotin)-OH 1:2 TFA ("Peptide A") was identified as a substrate for the TR-FRET assay by screening the 6× Hist...
Ligand InfoPC cidPC sid
In DepthDetails US Patent