BDBM228701 US10369153, Compound 245::US9346810, 245
SMILES C[C@H](O)CNS(=O)(=O)c1ccc(nc1)N(C)[C@@H]1CCN(C1)c1ncnc2[nH]ccc12
InChI Key InChIKey=GAPDHPCZTTYBLG-UONOGXRCSA-N
Data  2 IC50
  Tab Delimited (TSV)   2D SDfile   Computed 3D by Vconf -m prep SDfile
Find this compound or compounds like it in BindingDB:
Activity Spreadsheet -- Enzyme Inhibition Constant Data from BindingDB
Found 2 hits for monomerid = 228701
TargetTyrosine-protein kinase JAK1(Homo sapiens (Human))
Hutchison Medipharma
US Patent
LigandPNGBDBM228701(US10369153, Compound 245 | US9346810, 245)
Affinity DataIC50: <100nM. Assay description: JAK1/2/3 kinase assay are performed in vitro using Kit-Tyr 6 Peptide (Invitrogen, Cat. No. PV4122). TYK2 kinase assay are performed in vitro using Z&...
Ligand InfoPC cidPC sid
In DepthDetails US Patent
TargetTyrosine-protein kinase JAK1 [866-1154](Homo sapiens (Human))
Hutchison Medipharma
US Patent
LigandPNGBDBM228701(US10369153, Compound 245 | US9346810, 245)
Affinity DataIC50:  0.0550nMT: 2°C. Assay description: JAK1/2/3 kinase assay are performed in vitro using Kit-Tyr 6 Peptide (Invitrogen, Cat. No. PV4122). TYK2 kinase assay are performed in vitro using Z'...
Ligand InfoPC cidPC sid
In DepthDetails US Patent