BDBM228720 US10369153, Compound 73::US9346810, 73
SMILES CN([C@@H]1CCN(C1)c1ncnc2[nH]ccc12)c1nc(Cl)cc(C)c1C#N
InChI Key InChIKey=BEULMSQGFTWTJJ-GFCCVEGCSA-N
Data  4 IC50
  Tab Delimited (TSV)   2D SDfile   Computed 3D by Vconf -m prep SDfile
Find this compound or compounds like it in BindingDB:
Activity Spreadsheet -- Enzyme Inhibition Constant Data from BindingDB
Found 4 hits for monomerid = 228720
TargetTyrosine-protein kinase JAK2 [808-1132](Homo sapiens (Human))
Hutchison Medipharma
US Patent
LigandPNGBDBM228720(US10369153, Compound 73 | US9346810, 73)
Affinity DataIC50:  0.0550nMT: 2°C. Assay description: JAK1/2/3 kinase assay are performed in vitro using Kit-Tyr 6 Peptide (Invitrogen, Cat. No. PV4122). TYK2 kinase assay are performed in vitro using Z'...
Ligand InfoPC cidPC sid
In DepthDetails US Patent
TargetTyrosine-protein kinase JAK3(Homo sapiens (Human))
Hutchison Medipharma
US Patent
LigandPNGBDBM228720(US10369153, Compound 73 | US9346810, 73)
Affinity DataIC50:  550nM. Assay description: JAK1/2/3 kinase assay are performed in vitro using Kit-Tyr 6 Peptide (Invitrogen, Cat. No. PV4122). TYK2 kinase assay are performed in vitro using Z&...
Ligand InfoPC cidPC sid
In DepthDetails US Patent
TargetTyrosine-protein kinase JAK2(Homo sapiens (Human))
Hutchison Medipharma
US Patent
LigandPNGBDBM228720(US10369153, Compound 73 | US9346810, 73)
Affinity DataIC50: <100nM. Assay description: JAK1/2/3 kinase assay are performed in vitro using Kit-Tyr 6 Peptide (Invitrogen, Cat. No. PV4122). TYK2 kinase assay are performed in vitro using Z&...
Ligand InfoPC cidPC sid
In DepthDetails US Patent
TargetTyrosine-protein kinase JAK3 [781-1124](Homo sapiens (Human))
Hutchison Medipharma
US Patent
LigandPNGBDBM228720(US10369153, Compound 73 | US9346810, 73)
Affinity DataIC50:  0.550nMT: 2°C. Assay description: JAK1/2/3 kinase assay are performed in vitro using Kit-Tyr 6 Peptide (Invitrogen, Cat. No. PV4122). TYK2 kinase assay are performed in vitro using Z'...
Ligand InfoPC cidPC sid
In DepthDetails US Patent