BDBM229416 US9328099, 40-31
SMILES NC(=O)c1cn(nc1Nc1ccc(cc1)S(=O)(=O)C(F)F)C1(CC#N)CCC(CC1)N1CCC(F)(F)CC1
InChI Key InChIKey=GYSAXDBJNHZIQI-UHFFFAOYSA-N
Data  2 IC50
  Tab Delimited (TSV)   2D SDfile   Computed 3D by Vconf -m prep SDfile
Find this compound or compounds like it in BindingDB:
Activity Spreadsheet -- Enzyme Inhibition Constant Data from BindingDB
Found 2 hits for monomerid = 229416
TargetTyrosine-protein kinase JAK1(Homo sapiens (Human))
Merck Sharp & Dohme
US Patent
LigandPNGBDBM229416(US9328099, 40-31)
Affinity DataIC50:  0.100nMT: 2°C. Assay description: The reactions employed a common peptide substrate, LCB-EQEDEPEGDYFEWLW-NH2 (in-house). The basic assay protocol is as follows: First, 250 nL of dilut...
Ligand InfoPC cidPC sid
In DepthDetails US Patent
TargetTyrosine-protein kinase JAK2(Homo sapiens (Human))
Merck Sharp & Dohme
US Patent
LigandPNGBDBM229416(US9328099, 40-31)
Affinity DataIC50:  2nMT: 2°C. Assay description: The reactions employed a common peptide substrate, LCB-EQEDEPEGDYFEWLW-NH2 (in-house). The basic assay protocol is as follows: First, 250 nL of dilut...
Ligand InfoPC cidPC sid
In DepthDetails US Patent