BDBM229610 US9340506, B-20
SMILES OC(=O)c1ccc(Oc2cnc(NC(=O)C(OC3CCOCC3)c3ccc(cc3)S(=O)(=O)C3CC3)s2)cc1Cl
InChI Key InChIKey=DSXWXPSXXOQMMD-UHFFFAOYSA-N
Data  1 EC50
  Tab Delimited (TSV)   2D SDfile   Computed 3D by Vconf -m prep SDfile
Find this compound or compounds like it in BindingDB:
Activity Spreadsheet -- Enzyme Inhibition Constant Data from BindingDB
Found 1 hit for monomerid = 229610
TargetHexokinase-4(Homo sapiens (Human))
Advinus Therapeutics
US Patent
LigandPNGBDBM229610(US9340506, B-20)
Affinity DataEC50:  590nMpH: 7.2Assay Description:The assay is carried out according to the protocol outlined in Hariharan et al (1997), Diabetes 46: 11-16. Briefly, the test compounds are incubated ...
Ligand InfoPC cidPC sid
In DepthDetails US Patent