BDBM229614 US9340506, B-58
SMILES OC(=O)c1ccc(NC(=O)C(Oc2ccc(Cl)cc2)c2ccc(cc2)S(=O)(=O)C2CC2)nc1
InChI Key InChIKey=VICKYXCTCGJETM-UHFFFAOYSA-N
Data  1 EC50
  Tab Delimited (TSV)   2D SDfile   Computed 3D by Vconf -m prep SDfile
Find this compound or compounds like it in BindingDB:
Activity Spreadsheet -- Enzyme Inhibition Constant Data from BindingDB
Found 1 hit for monomerid = 229614
TargetHexokinase-4(Homo sapiens (Human))
Advinus Therapeutics
US Patent
LigandPNGBDBM229614(US9340506, B-58)
Affinity DataEC50:  740nMpH: 7.2Assay Description:The assay is carried out according to the protocol outlined in Hariharan et al (1997), Diabetes 46: 11-16. Briefly, the test compounds are incubated ...
Ligand InfoPC cidPC sid
In DepthDetails US Patent