BDBM22965 2-{1-[(4-chlorophenyl)carbonyl]-5-methoxy-2-methyl-1H-indol-3-yl}acetamide::CHEMBL95921::Indomethacin derivative, 18
SMILES COc1ccc2n(C(=O)c3ccc(Cl)cc3)c(C)c(CC(N)=O)c2c1
InChI Key InChIKey=YNDQHILWWBPAPR-UHFFFAOYSA-N
Data  4 IC50
  Tab Delimited (TSV)   2D SDfile   Computed 3D by Vconf -m prep SDfile
Find this compound or compounds like it in BindingDB:
Activity Spreadsheet -- Enzyme Inhibition Constant Data from BindingDB
Found 4 hits for monomerid = 22965
TargetProstaglandin G/H synthase 1(Ovis aries (Sheep))
Vanderbilt University School Of Medicine
LigandPNGBDBM22965(2-{1-[(4-chlorophenyl)carbonyl]-5-methoxy-2-methyl...)
Affinity DataIC50: >2.00E+4nMpH: 8.0 T: 2°C. Assay description: For the time-dependent inhibition studies, COX enzyme was incubated with test compounds for 20 min and then analyzed for remaining COX activity by tr...
In DepthDetails ArticlePubMed
TargetProstaglandin G/H synthase 2(Homo sapiens (Human))
Vanderbilt University School Of Medicine
Curated by ChEMBL
LigandPNGBDBM22965(2-{1-[(4-chlorophenyl)carbonyl]-5-methoxy-2-methyl...)
Affinity DataIC50:  700nM. Assay description: In vitro inhibitory activity against human Prostaglandin G/H synthase 2 (66 nM) using [14C]-AA (50 uM) was determined
In DepthDetails ArticlePubMed
TargetProstaglandin G/H synthase 1(Ovis aries (Sheep))
Vanderbilt University School Of Medicine
LigandPNGBDBM22965(2-{1-[(4-chlorophenyl)carbonyl]-5-methoxy-2-methyl...)
Affinity DataIC50: >2.00E+4nM. Assay description: In vitro inhibitory activity against ovine Prostaglandin G/H synthase 1 (44 nM) using [14C]AA (50 uM) was determined
In DepthDetails ArticlePubMed
TargetProstaglandin G/H synthase 2(Homo sapiens (Human))
Vanderbilt University School Of Medicine
Curated by ChEMBL
LigandPNGBDBM22965(2-{1-[(4-chlorophenyl)carbonyl]-5-methoxy-2-methyl...)
Affinity DataIC50:  700nMT: 2°C. Assay description: For the time-dependent inhibition studies, COX enzyme was incubated with test compounds for 20 min and then analyzed for remaining COX activity by tr...
In DepthDetails ArticlePubMed