BDBM229702 US9334269, 29
SMILES CNC(=O)c1cccc(Nc2ncnc(n2)N2CC(C2)Oc2ccccc2Cl)c1
InChI Key InChIKey=OAORXRRRIRGQKW-UHFFFAOYSA-N
Data  1 IC50
  Tab Delimited (TSV)   2D SDfile   Computed 3D by Vconf -m prep SDfile
Find this compound or compounds like it in BindingDB:
Activity Spreadsheet -- Enzyme Inhibition Constant Data from BindingDB
Found 1 hit for monomerid = 229702
TargetSodium channel protein type 9 subunit alpha(Homo sapiens (Human))
Amgen
US Patent
LigandPNGBDBM229702(US9334269, 29)
Affinity DataIC50:  420nM. Assay description: Compounds were tested on human Nav1.7 (hNav1.7) expressed stably in 293 cells, which have no endogenous sodium channels. Two forms of whole-cell patc...
Ligand InfoPC cidPC sid
In DepthDetails US Patent