BDBM229709 US9334269, 36
SMILES CNC(=O)c1cccc(Nc2ncnc(n2)N2CCC(CC2)C(=O)c2ccc(Cl)cc2)c1
InChI Key InChIKey=BZPJAJUGSCULSN-UHFFFAOYSA-N
Data  1 IC50
  Tab Delimited (TSV)   2D SDfile   Computed 3D by Vconf -m prep SDfile
Find this compound or compounds like it in BindingDB:
Activity Spreadsheet -- Enzyme Inhibition Constant Data from BindingDB
Found 1 hit for monomerid = 229709
TargetSodium channel protein type 9 subunit alpha(Homo sapiens (Human))
Amgen
US Patent
LigandPNGBDBM229709(US9334269, 36)
Affinity DataIC50:  490nM. Assay description: Compounds were tested on human Nav1.7 (hNav1.7) expressed stably in 293 cells, which have no endogenous sodium channels. Two forms of whole-cell patc...
Ligand InfoPC cidPC sid
In DepthDetails US Patent