BDBM230117 US9334290, 46
SMILES Cn1c2c(F)cccc2c(=O)n(-c2cccc(c2Cl)-c2c(F)cc(C(N)=O)c3[nH]c4cc(ccc4c23)C(C)(C)O)c1=O
InChI Key InChIKey=CACKWDPMBIYJAG-UHFFFAOYSA-N
Data  2 IC50
  Tab Delimited (TSV)   2D SDfile   Computed 3D by Vconf -m prep SDfile
Find this compound or compounds like it in BindingDB:
Activity Spreadsheet -- Enzyme Inhibition Constant Data from BindingDB
Found 2 hits for monomerid = 230117
TargetTyrosine-protein kinase JAK2(Homo sapiens (Human))
Bristol-Myers Squibb
US Patent
LigandPNGBDBM230117(US9334290, 46)
Affinity DataIC50:  2.00E+3nMpH: 7.4 T: 2°C. Assay description: The assays were performed in V-bottom 384-well plates. The final assay volume was 30 μl prepared from 15 μl additions of enzyme and substrates ...
Ligand InfoPC cidPC sid
In DepthDetails US Patent
TargetTyrosine-protein kinase BTK(Homo sapiens (Human))
Bristol-Myers Squibb
US Patent
LigandPNGBDBM230117(US9334290, 46)
Affinity DataIC50:  1.5nMpH: 7.4 T: 2°C. Assay description: To V-bottom 384-well plates were added test compounds, human recombinant Btk (1 nM, Invitrogen Corporation), fluoresceinated peptide (1.5 μM), ATP...
Ligand InfoPC cidPC sid
In DepthDetails US Patent