BDBM230157 US9340500, I-001
SMILES Cc1c(cc(n1CCCN1CCOCC1)C(C)(C)C)C(=O)OCc1ccccc1
InChI Key InChIKey=PEVIUJNBMSMJQK-UHFFFAOYSA-N
Data  1 KI
  Tab Delimited (TSV)   2D SDfile   Computed 3D by Vconf -m prep SDfile
Find this compound or compounds like it in BindingDB:
Activity Spreadsheet -- Enzyme Inhibition Constant Data from BindingDB
Found 1 hit for monomerid = 230157
TargetTransient receptor potential cation channel subfamily V member 4(Homo sapiens (Human))
Shionogi
US Patent
LigandPNGBDBM230157(US9340500, I-001)
Affinity DataKi:  3.96E+3nM ΔG°:  -7.66kcal/moleT: 2°C. Assay description: Test Example 3: (1) The TRPV4 inhibitory activity was measured using CHO-K1 cells stably expressing human TRPV4 (hTRPV4/CHO cells). (2) Frozen cells ...
Ligand InfoPC cidPC sid
In DepthDetails US Patent