BDBM230158 US9340500, I-002
SMILES Cc1c(cc(n1CCCN1CCOCC1)C(C)(C)C)C(=O)Nc1cccc(c1)C(F)(F)F
InChI Key InChIKey=CFJVVGBJJLBPQF-UHFFFAOYSA-N
Data  1 KI  1 IC50
  Tab Delimited (TSV)   2D SDfile   Computed 3D by Vconf -m prep SDfile
Find this compound or compounds like it in BindingDB:
Activity Spreadsheet -- Enzyme Inhibition Constant Data from BindingDB
Found 2 hits for monomerid = 230158
TargetTransient receptor potential cation channel subfamily V member 4(Homo sapiens (Human))
Shionogi
US Patent
LigandPNGBDBM230158(US9340500, I-002)
Affinity DataKi:  197nM ΔG°:  -9.51kcal/moleT: 2°C. Assay description: Test Example 3: (1) The TRPV4 inhibitory activity was measured using CHO-K1 cells stably expressing human TRPV4 (hTRPV4/CHO cells). (2) Frozen cells ...
Ligand InfoPC cidPC sid
In DepthDetails US Patent
TargetTransient receptor potential cation channel subfamily V member 4(Homo sapiens (Human))
Shionogi
US Patent
LigandPNGBDBM230158(US9340500, I-002)
Affinity DataIC50:  360nMT: 2°C. Assay description: Test Example 1: (1) The TRPV4 inhibitory activity was measured using CHO-K1 cells stably expressing human TRPV4 (hTRPV4/CHO cells). (2) In the day be...
Ligand InfoPC cidPC sid
In DepthDetails US Patent