BDBM230162 US9340500, I-006
SMILES Cc1c(cc(-c2ccccc2)n1CCCO)C(=O)Nc1cccc(c1)C(F)(F)F
InChI Key InChIKey=URPXIKPBWCUEEP-UHFFFAOYSA-N
Data  1 KI  1 IC50
  Tab Delimited (TSV)   2D SDfile   Computed 3D by Vconf -m prep SDfile
Find this compound or compounds like it in BindingDB:
Activity Spreadsheet -- Enzyme Inhibition Constant Data from BindingDB
Found 2 hits for monomerid = 230162
TargetTransient receptor potential cation channel subfamily V member 4(Homo sapiens (Human))
Shionogi
US Patent
LigandPNGBDBM230162(US9340500, I-006)
Affinity DataKi:  1.06E+3nM ΔG°:  -8.47kcal/moleT: 2°C. Assay description: Test Example 3: (1) The TRPV4 inhibitory activity was measured using CHO-K1 cells stably expressing human TRPV4 (hTRPV4/CHO cells). (2) Frozen cells ...
Ligand InfoPC cidPC sid
In DepthDetails US Patent
TargetTransient receptor potential cation channel subfamily V member 4(Homo sapiens (Human))
Shionogi
US Patent
LigandPNGBDBM230162(US9340500, I-006)
Affinity DataIC50:  2.30E+3nMT: 2°C. Assay description: Test Example 1: (1) The TRPV4 inhibitory activity was measured using CHO-K1 cells stably expressing human TRPV4 (hTRPV4/CHO cells). (2) In the day be...
Ligand InfoPC cidPC sid
In DepthDetails US Patent