BDBM230229 US9340500, I-073
SMILES Cc1c(cc(-c2ccccn2)n1CCCN1CCOCC1)C(=O)Nc1cccc(c1)C(F)(F)F
InChI Key InChIKey=UCQVDMUUOIMXKD-UHFFFAOYSA-N
Data  1 KI  1 IC50
  Tab Delimited (TSV)   2D SDfile   Computed 3D by Vconf -m prep SDfile
Find this compound or compounds like it in BindingDB:
Activity Spreadsheet -- Enzyme Inhibition Constant Data from BindingDB
Found 1 hit for monomerid = 230229
TargetTransient receptor potential cation channel subfamily V member 4(Homo sapiens (Human))
Shionogi
US Patent
LigandPNGBDBM230229(US9340500, I-073)
Affinity DataKi:  160nM ΔG°:  -9.64kcal/mole IC50:  340nMT: 2°C. Assay description: Test Example 1: (1) The TRPV4 inhibitory activity was measured using CHO-K1 cells stably expressing human TRPV4 (hTRPV4/CHO cells). (2) In the day be...
Ligand InfoPC cidPC sid
In DepthDetails US Patent