BDBM230286 US9340507, 1.1
SMILES CCn1cc(C(=O)NCc2ccc(cc2)S(C)(=O)=O)c(=O)c(c1C)-c1cccc(c1)C(F)(F)F
InChI Key InChIKey=ACPWSGXTGYUGNF-UHFFFAOYSA-N
Data  1 IC50
  Tab Delimited (TSV)   2D SDfile   Computed 3D by Vconf -m prep SDfile
Find this compound or compounds like it in BindingDB:
Activity Spreadsheet -- Enzyme Inhibition Constant Data from BindingDB
Found 1 hit for monomerid = 230286
TargetNeutrophil elastase(Homo sapiens (Human))
Boehringer Ingelheim International
US Patent
LigandPNGBDBM230286(US9340507, 1.1)
Affinity DataIC50:  33nMpH: 7.5 T: 2°C. Assay description: Compound buffer: 100 mM Tris, 500 mM NaCl, adjusted to pH 7.5; Assay buffer: 100 mM Tris, 500 mM NaCl, adjusted to pH 7.5, containing 0.01% BSA. Test...
Ligand InfoPC cidPC sid
In DepthDetails US Patent