BDBM230305 US9340507, 3.9
SMILES CC(C)n1cc(C(=O)NCc2ccc(CN3CCCC3=O)cc2)c(=O)c(c1C)-c1cccc(c1)C(F)(F)F
InChI Key InChIKey=GVZLHJFVWYZJOL-UHFFFAOYSA-N
Data  1 IC50
  Tab Delimited (TSV)   2D SDfile   Computed 3D by Vconf -m prep SDfile
Find this compound or compounds like it in BindingDB:
Activity Spreadsheet -- Enzyme Inhibition Constant Data from BindingDB
Found 1 hit for monomerid = 230305
TargetNeutrophil elastase(Homo sapiens (Human))
Boehringer Ingelheim International
US Patent
LigandPNGBDBM230305(US9340507, 3.9)
Affinity DataIC50:  20nMpH: 7.5 T: 2°C. Assay description: Compound buffer: 100 mM Tris, 500 mM NaCl, adjusted to pH 7.5; Assay buffer: 100 mM Tris, 500 mM NaCl, adjusted to pH 7.5, containing 0.01% BSA. Test...
Ligand InfoPC cidPC sid
In DepthDetails US Patent