BDBM230710 US9340530, 45
SMILES [H][C@@]12[C@@H](C)OC(=O)[C@@]1(CC(F)(F)[C@@]([H])(C)[C@@H]2\C=C\c1ccc(cn1)-c1ccccc1C#N)NCc1cnccn1
InChI Key InChIKey=ZFTXSXZWKQIUOU-DBFNFULISA-N
Data  1 IC50
  Tab Delimited (TSV)   2D SDfile   Computed 3D by Vconf -m prep SDfile
Find this compound or compounds like it in BindingDB:
Activity Spreadsheet -- Enzyme Inhibition Constant Data from BindingDB
Found 1 hit for monomerid = 230710
TargetProteinase-activated receptor 1(Homo sapiens (Human))
Merck Sharp & Dohme
US Patent
LigandPNGBDBM230710(US9340530, 45)
Affinity DataIC50:  4.40nM. Assay description: HEK 293 Cells were grown in media containing DMEM, 10% FBS pen/strep/L-Glutamine and non-essential amino acids. The cells were plated in 384-well PDL...
Ligand InfoPC cidPC sid
In DepthDetails US Patent