BDBM230720 US9340530, 55
SMILES C[C@H]1OC(=O)[C@]2(CC(F)(F)C(C)[C@H](\C=C\c3ccc(cn3)-c3ccccc3C#N)C12)NC(=S)NC1CC1
InChI Key InChIKey=OWPQEQLEWDIPQP-IVZMUVIJSA-N
Data  1 IC50
  Tab Delimited (TSV)   2D SDfile   Computed 3D by Vconf -m prep SDfile
Find this compound or compounds like it in BindingDB:
Activity Spreadsheet -- Enzyme Inhibition Constant Data from BindingDB
Found 1 hit for monomerid = 230720
TargetProteinase-activated receptor 1(Homo sapiens (Human))
Merck Sharp & Dohme
US Patent
LigandPNGBDBM230720(US9340530, 55)
Affinity DataIC50:  6.30nM. Assay description: HEK 293 Cells were grown in media containing DMEM, 10% FBS pen/strep/L-Glutamine and non-essential amino acids. The cells were plated in 384-well PDL...
Ligand InfoPC cidPC sid
In DepthDetails US Patent