BDBM230760 US9340537, 14::US9896444, Example 14
SMILES C[C@@]1(O)CCN(C1)c1ncc(cc1-c1ccn[nH]1)C(=O)Nc1ccc(OC(F)(F)F)cc1
InChI Key
Data  7 IC50
  Tab Delimited (TSV)   2D SDfile   Computed 3D by Vconf -m prep SDfile
Find this compound or compounds like it in BindingDB:
Activity Spreadsheet -- Enzyme Inhibition Constant Data from BindingDB
Found 7 hits for monomerid = 230760
TargetTyrosine-protein kinase ABL1 [64-515](Homo sapiens (Human))
Novatis
US Patent
LigandPNGBDBM230760(US9340537, 14 | US9896444, Example 14)
Affinity DataIC50:  2.5nMpH: 7.5 T: 2°C. Assay description: The assay was performed by mixing 10 μL of the compound pre-diluted with 10 μL of ATP (20 μM ATP with 0.1 μCi [γ-33P]-ATP) with the...
Ligand InfoPC cidPC sid
In DepthDetails US Patent
TargetTyrosine-protein kinase ABL1 [64-515](Homo sapiens (Human))
Novatis
US Patent
LigandPNGBDBM230760(US9340537, 14 | US9896444, Example 14)
Affinity DataIC50:  2.80nMpH: 7.5 T: 2°C. Assay description: The assay plates were prepared by addition of 50 nL per well of compound solution in 90% DMSO. The kinase reactions were started by stepwise addition...
Ligand InfoPC cidPC sid
In DepthDetails US Patent
TargetTyrosine-protein kinase ABL1 [64-515](Homo sapiens (Human))
Novatis
US Patent
LigandPNGBDBM230760(US9340537, 14 | US9896444, Example 14)
Affinity DataIC50:  2.5nM. Assay description: Radio ABL1 (64-515) Assay: For determination of ABL kinase activity, the radiometric filter-binding assay was used. The assay was performed by mixing...
Ligand InfoPC cidPC sid
In DepthDetails US Patent
TargetPotassium voltage-gated channel subfamily H member 2(Homo sapiens (Human))
Novartis Institutes For Biomedical Research
Curated by ChEMBL
LigandPNGBDBM230760(US9340537, 14 | US9896444, Example 14)
Affinity DataIC50: >3.00E+4nM. Assay description: Displacement of [3H]dofetilide from human ERG by high throughput assay
Ligand InfoPC cidPC sid
In DepthDetails ArticlePubMed
TargetTyrosine-protein kinase ABL1(Homo sapiens (Human))
Novartis Institutes For Biomedical Research
Curated by ChEMBL
LigandPNGBDBM230760(US9340537, 14 | US9896444, Example 14)
Affinity DataIC50:  1.60nM. Assay description: Inhibition of ABL1 (64 to 515 residues)(unknown origin) expressed in Escherichia coli using FITC-Ahx-EAIYAAPFAKKK-NH2 peptide as substrate after 60 m...
Ligand InfoPC cidPC sid
In DepthDetails ArticlePubMed
TargetPotassium voltage-gated channel subfamily H member 2(Homo sapiens (Human))
Novartis Institutes For Biomedical Research
Curated by ChEMBL
LigandPNGBDBM230760(US9340537, 14 | US9896444, Example 14)
Affinity DataIC50: >3.00E+4nM. Assay description: Inhibition of human ERG by automated patch clamp assay
Ligand InfoPC cidPC sid
In DepthDetails ArticlePubMed
TargetTyrosine-protein kinase ABL1 [64-515](Homo sapiens (Human))
Novatis
US Patent
LigandPNGBDBM230760(US9340537, 14 | US9896444, Example 14)
Affinity DataIC50:  2.80nM. Assay description: Caliper ABL1 (64-515) Assay: The assay plates were prepared by addition of 50 nL per well of compound solution in 90% DMSO. The kinase reactions were...
Ligand InfoPC cidPC sid
In DepthDetails US Patent