BDBM230762 US9340537, 16::US9896444, Example 16
SMILES Cc1ncc(s1)-c1cc(cnc1N1CC[C@H](CO)C1)C(=O)Nc1ccc(OC(F)(F)F)cc1
InChI Key InChIKey=YVNHSZYGEWWXAF-AWEZNQCLSA-N
Data  4 IC50
  Tab Delimited (TSV)   2D SDfile   Computed 3D by Vconf -m prep SDfile
Find this compound or compounds like it in BindingDB:
Activity Spreadsheet -- Enzyme Inhibition Constant Data from BindingDB
Found 4 hits for monomerid = 230762
TargetTyrosine-protein kinase ABL1 [64-515](Homo sapiens (Human))
Novatis
US Patent
LigandPNGBDBM230762(US9340537, 16 | US9896444, Example 16)
Affinity DataIC50: <3nMpH: 7.5 T: 2°C. Assay description: The assay was performed by mixing 10 μL of the compound pre-diluted with 10 μL of ATP (20 μM ATP with 0.1 μCi [γ-33P]-ATP) with the...
Ligand InfoPC cidPC sid
In DepthDetails US Patent
TargetTyrosine-protein kinase ABL1 [64-515](Homo sapiens (Human))
Novatis
US Patent
LigandPNGBDBM230762(US9340537, 16 | US9896444, Example 16)
Affinity DataIC50:  1.10nM. Assay description: Caliper ABL1 (64-515) Assay: The assay plates were prepared by addition of 50 nL per well of compound solution in 90% DMSO. The kinase reactions were...
Ligand InfoPC cidPC sid
In DepthDetails US Patent
TargetTyrosine-protein kinase ABL1 [64-515](Homo sapiens (Human))
Novatis
US Patent
LigandPNGBDBM230762(US9340537, 16 | US9896444, Example 16)
Affinity DataIC50: <3nM. Assay description: Radio ABL1 (64-515) Assay: For determination of ABL kinase activity, the radiometric filter-binding assay was used. The assay was performed by mixing...
Ligand InfoPC cidPC sid
In DepthDetails US Patent
TargetTyrosine-protein kinase ABL1 [64-515](Homo sapiens (Human))
Novatis
US Patent
LigandPNGBDBM230762(US9340537, 16 | US9896444, Example 16)
Affinity DataIC50:  1.10nMpH: 7.5 T: 2°C. Assay description: The assay plates were prepared by addition of 50 nL per well of compound solution in 90% DMSO. The kinase reactions were started by stepwise addition...
Ligand InfoPC cidPC sid
In DepthDetails US Patent