BDBM231027 US9340549, 44
SMILES O=C(Nc1cccc2cccnc12)c1ccc(cc1)N1C(c2ccccc2)C2(CCC2)OC1=O
InChI Key InChIKey=PZXVZNLILWMZDB-UHFFFAOYSA-N
Data  1 IC50
  Tab Delimited (TSV)   2D SDfile   Computed 3D by Vconf -m prep SDfile
Find this compound or compounds like it in BindingDB:
Activity Spreadsheet -- Enzyme Inhibition Constant Data from BindingDB
Found 1 hit for monomerid = 231027
TargetPoly [ADP-ribose] polymerase tankyrase-1 [1091-1325](Homo sapiens (Human))
Amgen
US Patent
LigandPNGBDBM231027(US9340549, 44)
Affinity DataIC50:  822nMT: 2°C. Assay description: The tankyrase 1 biochemical activity of the compounds was assayed in the following assay buffer (50 mM MOPS pH7.5, 100 mM NaCl, 2.5 mM MgCl2, 0.01% T...
Ligand InfoPC cidPC sid
In DepthDetails US Patent