BDBM231079 US9340549, 104
SMILES CC1(C)OC(=O)N([C@H]1c1ccccc1)[C@H]1CC[C@@H](CC1)n1c2cc(F)cc(F)c2[nH]c1=O
InChI Key
Data  1 IC50
  Tab Delimited (TSV)   2D SDfile   Computed 3D by Vconf -m prep SDfile
Find this compound or compounds like it in BindingDB:
Activity Spreadsheet -- Enzyme Inhibition Constant Data from BindingDB
Found 1 hit for monomerid = 231079
TargetPoly [ADP-ribose] polymerase tankyrase-1 [1091-1325](Homo sapiens (Human))
Amgen
US Patent
LigandPNGBDBM231079(US9340549, 104)
Affinity DataIC50:  93nMT: 2°C. Assay description: The tankyrase 1 biochemical activity of the compounds was assayed in the following assay buffer (50 mM MOPS pH7.5, 100 mM NaCl, 2.5 mM MgCl2, 0.01% T...
Ligand InfoPC cidPC sid
In DepthDetails US Patent