BDBM231115 US9340549, 140
SMILES CC1(C)OC(=O)N([C@H]1c1ccccc1)C1CCN(CC1)c1cnc2ccn(-c3ncccn3)c2c1
InChI Key InChIKey=KNGNUPLYIUTXCN-DEOSSOPVSA-N
Data  1 IC50
  Tab Delimited (TSV)   2D SDfile   Computed 3D by Vconf -m prep SDfile
Find this compound or compounds like it in BindingDB:
Activity Spreadsheet -- Enzyme Inhibition Constant Data from BindingDB
Found 1 hit for monomerid = 231115
TargetPoly [ADP-ribose] polymerase tankyrase-1 [1091-1325](Homo sapiens (Human))
Amgen
US Patent
LigandPNGBDBM231115(US9340549, 140)
Affinity DataIC50:  24.3nMT: 2°C. Assay description: The tankyrase 1 biochemical activity of the compounds was assayed in the following assay buffer (50 mM MOPS pH7.5, 100 mM NaCl, 2.5 mM MgCl2, 0.01% T...
Ligand InfoPC cidPC sid
In DepthDetails US Patent