BDBM231208 Sodium 6-chloro-7-(4-(2-(2-chlorophenoxyl)ethylcarbamoyl)phenoxy)chroman-4-carboxylate::US9556139, 115
SMILES OC(=O)C1CCOc2cc(Oc3ccc(cc3)C(=O)NCCOc3ccccc3Cl)c(Cl)cc12
InChI Key InChIKey=XACRZCCRAHUMSX-UHFFFAOYSA-N
Data  1 EC50
  Tab Delimited (TSV)   2D SDfile   Computed 3D by Vconf -m prep SDfile
Find this compound or compounds like it in BindingDB:
Activity Spreadsheet -- Enzyme Inhibition Constant Data from BindingDB
Found 1 hit for monomerid = 231208
TargetProstaglandin D2 receptor 2(Homo sapiens (Human))
Array Biopharma
US Patent
LigandPNGBDBM231208(Sodium 6-chloro-7-(4-(2-(2-chlorophenoxyl)ethylcar...)
Affinity DataEC50:  2.44E+3nMpH: 7.4 T: 2°C. Assay description: The coding sequence of human DP2 was introduced into the human Leukemic cell line K562 by electroporation and stable clones expressing DP2 were obtai...
Ligand InfoPC cidPC sid
In DepthDetails US Patent